{"text_format":"1","workbook":"xlsx","n_sheets":5,"sheets":["EtOH Summary","EtOH","EF Tables","Fuel_Specs","NG and Imported Steam"],"not_rendered":{"charts":0,"images":2,"macros":1,"external_links":3,"defined_names":45,"comments":2,"pivot_tables":0},"unopened":[],"bounds":{"document_bytes":16777216,"sheet_cells":100000,"rows_first":2000,"rows_last":500,"rows_between":2000,"halvings":0,"cell_chars":16384,"cell_head_chars":4096},"cells_cut":0,"cells_raw":0,"read":"whole","date_system":"1900"}

{"sheet":"EtOH Summary","index":0,"n_rows":32,"n_cols":15,"rows_kept":32,"cut":false,"hidden":false,"merged":[[0,2,1,7],[7,9,7,10],[6,2,6,3],[2,3,2,5],[2,6,2,7],[4,3,4,7],[7,6,7,7],[7,2,7,4]]}
[null,null,"Summary of the Tier 1 Starch and Fiber Ethanol Pathway(s) \nRelease Date:  August 13, 2018"]
[]
[null,null,"Applicant:",{"$f":"IF(EtOH!D21=\"\",\"\",EtOH!D21)","v":"ABCDEFG Ethanol"},null,null,{"$f":"CONCATENATE(\"Location:  \",EtOH!D24)","v":"Location:  HIJKLMN City, IA "}]
[null,null,"Application Number",{"$f":"IF(EtOH!H21=\"\",\"\",EtOH!H21)","v":"A0123"}]
[null,null,"Description:",{"$f":"IF(EtOH!G24=\"\",\"\",EtOH!G24)","v":"Midwest Corn ethanol "}]
[]
[null,null,"Feedstock Production Electricity Mix",null,"1- U.S Ave Mix",null,"Fuel Production Electricity Mix",{"$f":"EtOH!BM29","v":"3-CAMX Mix"}]
[null,null,"Feedstock Production",null,null,null,"Fuel Production",null,null,"Different Scenarios of Starch Ethanol Production",null,"Carbon Intensity (gCO2e/MJ)","Conservative Margin of Safety (gCO2e/MJ)","Total Carbon Intensity (gCO2e/MJ)","Correspondent Volumes (denatured gallons)"]
[null,null,"Feedstock Production","Column2","Column1",null,"Fuel Production","Column1",null,"Different Scenarios of Ethanol Production","Column1","Carbon Intensity, g/MJ","Column3","Column2","Correspondent Volumes, gallons"]
[null,null,"Corn Use, bushels",null,{"$f":"EtOH!D57","v":79775294},null,"Total Undenatured Ethanol, gallons",{"$f":"EtOH!AX57","v":218694177},null,null,"Dry DG",{"$f":"EtOH!D12","v":73.859993669256696},0,{"$f":"Table13[[#This Row],[Carbon Intensity, g/MJ]]+Table13[[#This Row],[Column3]]","v":73.859993669256696},{"$f":"EtOH!AG75","v":23759667.384553418}]
[null,null,"Sorghum Use, bushels",null,{"$f":"EtOH!L57","v":0},null,"Total Undenatured Starch Ethanol, gallons",{"$f":"EtOH!AE69+EtOH!AE70","v":215514643.64112416},null,"Corn Ethanol","Modified DG",{"$f":"EtOH!D14","v":0},0,{"$f":"Table13[[#This Row],[Carbon Intensity, g/MJ]]+Table13[[#This Row],[Column3]]","v":0},{"$f":"EtOH!AG76","v":0}]
[null,null,"Ethanol Yield, gal/bushels",null,{"$f":"EtOH!E80","v":2.7413772614864946},null,"Total Undenatured Fiber Ethanol, gallons",{"$f":"EtOH!BE57","v":3179533.3588758316},null,null,"Wet DG",{"$f":"EtOH!D16","v":64.072442660290676},0,{"$f":"Table13[[#This Row],[Carbon Intensity, g/MJ]]+Table13[[#This Row],[Column3]]","v":64.072442660290676},{"$f":"EtOH!AG77","v":195669027.42746791}]
[]
[null,null,"Feedstock Transport (Weighted Average)",null,null,null,"Energy Consumption",null,null,null,"Dry DG",{"$f":"EtOH!G12","v":0},0,{"$f":"Table13[[#This Row],[Carbon Intensity, g/MJ]]+Table13[[#This Row],[Column3]]","v":0},{"$f":"EtOH!AJ75","v":0}]
[null,null,"Corn Transport by HD Truck, miles",null,{"$f":"EtOH!H57","v":33.313526751255957},null,"Natural, HHV in MMBtu",{"$f":"EtOH!BG57","v":4468320},null,"Sorghum Ethanol","Modified DG",{"$f":"EtOH!G14","v":0},0,{"$f":"Table13[[#This Row],[Carbon Intensity, g/MJ]]+Table13[[#This Row],[Column3]]","v":0},{"$f":"EtOH!AJ76","v":0}]
[null,null,"Corn Transport by Rail, miles",null,{"$f":"EtOH!J57","v":"0"},null,"Biogas, HHV in MMBtu",{"$f":"EtOH!BH57","v":0},null,null,"Wet DG",{"$f":"EtOH!G16","v":0},0,{"$f":"Table13[[#This Row],[Carbon Intensity, g/MJ]]+Table13[[#This Row],[Column3]]","v":0},{"$f":"EtOH!AJ77","v":0}]
[null,null,null,null,null,null,"Biomass, Tons",{"$f":"EtOH!BI57","v":0}]
[null,null,"Sorghum Transport by HD Truck, miles",null,{"$f":"EtOH!P57","v":"0"},null,"Electricity, kWh",{"$f":"EtOH!BL57","v":116572914},null,"Corn/Sorghum Fiber Ethanol",null,{"$f":"EtOH!J10","v":24.20061441792167},0,{"$f":"Table13[[#This Row],[Carbon Intensity, g/MJ]]+Table13[[#This Row],[Column3]]","v":24.20061441792167},{"$f":"EtOH!AG78","v":3237278.1879786639}]
[null,null,"Sorghum Transport by Rail, miles",null,{"$f":"EtOH!R57","v":"0"},null,"Other Electricity, kWh",{"$f":"EtOH!BM57","v":0}]
[null,null,null,null,null,null,null,null,null,"Corn Ethanol","Composite ",{"$f":"IFERROR((L10*O10+L11*O11+L12*O12)/O20,0)","v":65.132235485844333},0,{"$f":"Table13[[#This Row],[Carbon Intensity, g/MJ]]+Table13[[#This Row],[Column3]]","v":65.132235485844333},{"$f":"EtOH!AE75","v":219428694.81202132}]
[null,null,"Co-Product Yield, bone-dry lb./gal",null,{"$f":"EtOH!AS57","v":5.0934875855428006},null,"Chemical Usage for Cellulosic",null,null,"Sorghum Ethanol","Composite",{"$f":"IFERROR((L14*O14+L15*O15+L16*O16)/O21,0)","v":0},0,{"$f":"Table13[[#This Row],[Carbon Intensity, g/MJ]]+Table13[[#This Row],[Column3]]","v":0},{"$f":"EtOH!AE76","v":0}]
[null,null,"Dry Distiller Grains, tons",null,{"$f":"EtOH!T57","v":66653},null,"Cellulosic Enzyme, lbs.",{"$f":"EtOH!BB57","v":0}]
[null,null,"Moisture, %",null,{"$f":"EtOH!W57","v":0.12628754894753424}]
[null,null,"Drying Energy, HHV in MMBtu",null,{"$f":"EtOH!X57","v":287991},null,"Fuel Transport"]
[null,null,"Modified Distiller Grains, tons",null,{"$f":"EtOH!Z57","v":0},null,"By HD Truck, miles",{"$f":"EtOH!BO35","v":53}]
[null,null,"Moisture, %",null,{"$f":"EtOH!AC57","v":0},null,"By Rail, miles",{"$f":"EtOH!BO33","v":2056}]
[null,null,"Drying Energy, HHV in MMBtu",null,{"$f":"EtOH!AD57","v":0}]
[null,null,"Wet Distiller Grains, tons",null,{"$f":"EtOH!AF57","v":1347074},null,"Denaturant Usage",{"$f":"IFERROR(EtOH!AY57/EtOH!AU57,0)","v":2.4174734901773957E-2}]
[null,null,"Moisture, %",null,{"$f":"EtOH!AI57","v":0.64397663380037029},null,"Denaturant, gallons",{"$f":"EtOH!AY57","v":3971796}]
[null,null,"Syrup DGS, tons",null,{"$f":"EtOH!AK57","v":0}]
{"$rows_left_out":3}
{"sheet":"EtOH","index":1,"n_rows":113,"n_cols":69,"rows_kept":113,"cut":false,"hidden":false,"merged":[[72,29,72,36],[78,29,78,30],[76,8,76,10],[76,4,76,7],[75,1,75,10],[76,2,76,3],[90,2,90,3],[89,2,89,3],[81,2,81,3],[79,2,79,3],[67,4,67,5],[67,2,67,3],[91,2,91,3],[105,2,105,3],[107,2,107,3],[109,2,109,3],[96,2,96,3],[93,2,93,3],[95,2,95,3],[97,2,97,3],[103,2,103,3],[98,2,98,3],[100,2,100,3],[1,4,1,10],[23,1,23,2],[20,1,20,2],[11,4,11,5],[12,1,12,2],[12,4,12,5],[13,1,13,2],[13,4,13,5],[14,1,14,2],[22,1,22,2],[21,1,21,2],[20,3,20,5],[14,4,14,5],[15,1,15,2],[5,1,5,2],[11,1,11,2],[8,1,8,9],[9,1,9,2],[9,4,9,5],[9,7,9,8],[10,1,10,2],[10,4,10,5],[10,7,10,8],[30,65,30,66],[29,51,29,56],[29,65,29,66],[29,24,29,29],[29,30,29,34],[29,35,29,39],[66,39,66,40],[67,41,67,44],[67,25,67,28],[64,1,64,68],[58,65,58,66],[67,45,67,48],[67,12,67,13],[67,6,67,7],[25,4,25,7],[28,1,28,5],[29,1,29,5],[59,62,60,62],[59,59,60,59],[29,8,29,9],[29,18,29,23],[28,6,28,9],[59,60,60,60],[28,58,28,63],[29,45,29,49],[28,45,28,56],[29,14,29,15],[28,10,28,13],[29,16,29,17],[30,14,30,17],[30,6,30,9],[67,8,67,9],[67,10,67,11],[66,29,66,36],[66,37,66,38],[24,3,24,7],[15,4,15,5],[40,65,42,66],[29,58,29,64],[29,40,29,43],[29,10,29,13],[16,4,16,5],[28,18,28,44],[19,1,19,7],[21,3,21,7],[22,3,22,7],[23,3,23,4],[23,6,23,7],[24,1,24,2],[28,14,28,17],[16,1,16,2]]}
[]
[]
[]
[]
[]
[]
[null,null,"LCFS Tier 1 Simplified CI Calculator for Starch and Fiber Ethanol"]
[]
[null,"Pathway Summary and Estimated CI (g/MJ)",null,null,null,null,null,null,null,null,null,"Yellow Cells require user input"]
[null,"Corn Ethanol Composite CI, g/MJ ",null,{"$f":"IFERROR((D12*D13+D14*D15+D16*D17)/AE75,0)","v":65.132235485844333},"Sorghum Ethanol (Composite CI), g/MJ ",null,{"$f":"IFERROR((G12*G13+G14*G15+G16*G17)/AE76,0)","v":0},"Corn/Sorghum Fiber Ethanol CI, g/MJ",null,{"$f":"IF(BE57=0,0,(H89+H93+H97+H103+H105+H107+H109+H99+H101)*'EF Tables'!D77+(H111+H112+H113))","v":24.20061441792167},null,"Light Blue Cells show CI results "]
[null,"Denatured Volume, gal",null,{"$f":"AE75","v":219428694.81202132},"Denatured Volume, gal ",null,{"$f":"AE76","v":0},"Denatured Ethanol Volume, gal ",null,{"$f":"AE78","v":3237278.1879786639},null,"Green Cells show the calculation button"]
[null,"Corn Ethanol (Dry DGS) CI, g/MJ",null,{"$f":"IF(OR(D57=0,T57=0),0,(E82+E84+E86+E93+E95+E97+E103+E105+E107+E109+E99+E101)*'EF Tables'!D77+(E111+E112+E113))","v":73.859993669256696},"Sorghum Ethanol (Dry DGS) CI, g/MJ",null,{"$f":"IF(OR(T57=0,L57=0),0,(I82+I84+I86+I93+I95+I97+I103+I105+I107+I109+I99+I101)*'EF Tables'!D77+(I111+I112+I113))","v":0},null,null,null,null,"Gray Cells are Calculated Values"]
[null,"Denatured Volume, gal",null,{"$f":"AG75","v":23759667.384553418},"Denatured Volume, gal",null,{"$f":"AJ75","v":0}]
[null,"Corn Ethanol (Modified DGS) CI, g/MJ",null,{"$f":"IF(OR(D57=0,Z57=0),0,(F82+F84+F86+F93+F95+F97+F103+F105+F107+F109+F99+F101)*'EF Tables'!D77+(F111+F112+F113))","v":0},"Sorghum Ethanol (Modified DGS) CI, g/MJ",null,{"$f":"IF(OR(Z57=0,L57=0),0,(J82+J84+J86+J93+J95+J97+J103+J105+J107+J109+J99+J101)*'EF Tables'!D77+(J111+J112+J113))","v":0}," "," "," "]
[null,"Denatured Volume, gal",null,{"$f":"AG76","v":0},"Denatured Volume, gal",null,{"$f":"AJ76","v":0}," "," "," "]
[null,"Corn Ethanol (Wet DGS) CI, g/MJ",null,{"$f":"IF(OR(D57=0,AF57=0), 0,(G82+G84+G86+G93+G95+G97+G103+G105+G107+G109+G99+G101)*'EF Tables'!D77+(G111+G112+G113))","v":64.072442660290676},"Sorghum Ethanol (Wet DGS) CI, g/MJ",null,{"$f":"IF(OR(AF57=0,L57=0),0,(K82+K84+K86+K93+K95+K97+K103+K105+K107+K109+K99+K101)*'EF Tables'!D77+(K111+K112+K113))","v":0}," "," "," "]
[null,"Denatured Volume, gal",null,{"$f":"AG77","v":195669027.42746791},"Denatured Volume, gal",null,{"$f":"AJ77","v":0}," "," "," "]
[]
[]
[null,"Section 1.  Applicant Information"]
[null,"1.1. Company Name",null,"ABCDEFG Ethanol",null,null,"1.2. Application Number","A0123"]
[null,"1.3. Company ID ",null,1234]
[null,"1.4. Facility ID",null,1234]
[null,"1.5. Ethanol Production Location \n(City, State)",null,"HIJKLMN City, IA ",null,"1.6. Application Description","Midwest Corn ethanol "]
[null,"1.7. Electricity Mix Region for Feedstock",null,"1-U.S Ave Mix"]
[null,"1.8. Provisional Pathway?",null,"No"]
[]
[null,"Section 2. Feedstock Production Data for Starch Ethanol Production",null,null,null,null,null,null,null,null,null,null,null,null,null,null,null,null,null,null,null,null,null,null,null,null,null,null,null,null,null,null,null,null,null,null,null,null,null,null,null,null,null,null,null,null,null,null,null,null,null,null,null,null,null,null,null,null,"Section 3. Fuel Production Energy Consumption and Fuel Transport Data"]
[null,"Corn as Feedstock",null,null,null,null," Corn Transport ",null,null,null,"Sorghum as Feedstock",null,null,null,"Sorghum Transport",null,null,null,"Co-Product Production",null,null,null,null,null,null,null,null,null,null,null,null,null,null,null,null,null,null,null,null,null,null,null,null,null,null,"Fuel Production",null,null,null,null,null,null,null,null,null,null,null,null,"3.1. Electricity Mix Region for Fuel",null,null,null,null,null,"3-CAMX Mix",{"$f":"IF(BM29=\"2-User Defined Mix\",\"3.10. Enter Electricity Generation GHG Emission Factor \n(gCO2e/kWh)\",\"\")","v":""}]
[null,"Corn Inventory",null,null,null,null,"2.6. Corn Transport Data Category",null,"Conditional Default for Ethanol Plants in CA",null,"Sorghum Inventory",null,null,null,"2.12. Sorghum Transport Data Category",null,"User-Defined for Sorghum Transport",null,"Dry Distiller Grains",null,null,null,null,null,"Modified Distiller Grains",null,null,null,null,null,"Wet Distiller Grains",null,null,null,null,"Syrup",null,null,null,null,"Corn/Sorghum Oil",null,null,null,null,"Starch Ethanol Production",null,null,null,null,"2.46. \nDenaturant Data Category","Cellulosic Ethanol Production",null,null,null,null,null,null,"Energy Consumption ",null,null,null,null,null,null,"Fuel Transport and Distribution"]
{"$rows_left_out":84}
{"sheet":"EF Tables","index":2,"n_rows":77,"n_cols":32,"rows_kept":77,"cut":false,"hidden":false,"merged":[[0,1,0,12],[42,6,42,8],[43,7,43,8]]}
[null,"Greenhouse Gases Emissions Factors Used in CA-GREET 3.0 for Carbon Intensity Calculations\n(see \"CA-GREET 3.0 for EF Table\")"]
[null,"GHG Emission Factors ","1-U.S Ave Mix","2-User Defined Mix","3-CAMX Mix","4-NWPP Mix","5-AZNM Mix","6-RMPA Mix","7-MROW Mix","8-SPNO Mix","9-SPSO Mix","10-ERCT Mix","11-MROE Mix","12-SRMW Mix","13-SRMV Mix","14-RFCM Mix","15-RFCW Mix","16-SRTV Mix","17-SRSO Mix","18-NEWE Mix","19-NYUP Mix","20-RFCE Mix","21-NYLI Mix","22-NYCW Mix","23-SRVC Mix","24-FRCC Mix","25-AKMS Mix","26-AKGD Mix","27-HIOA Mix","28-HIMS Mix","29-Brazilian Mix","30-Canadian Mix"]
[null,"Emissions from Electricity use (gCO2e/kWh) ",610.34189145985738,{"$f":"EtOH!BO29","v":0},370.21536152172285,476.66755891530761,460.82859297371101,851.03020657968534,684.35343913567101,792.60226004051526,795.05469323281625,638.59301682740761,892.00690603787143,924.3059717481699,614.24740326892186,785.91730144285464,738.42690476572875,682.14171976483931,628.53837254067525,356.89849018378067,231.08115430320504,462.51078261890473,627.05639089482747,356.83383543633607,493.61813345282064,601.65033646121844,161.95715526219328,747.57263119603965,1127.5361384383039,680.49572467317205,193.69249304296969,176.23247881407806]
[]
[null,"Non-combustion (gCO2e/MJ)",{"$f":"2.239/Fuel_Specs!$I$8*Fuel_Specs!$B$17*$D$77","v":8.6694746909554699E-2}]
[null,"Enzymes and Yeast (gCO2e/MJ)",2.02]
[]
[null,null,"Corn Farming, Fertilizers, N2O in soil"]
[null,null,null,"Farming","Fertilizers","N2O in soil","Total, gCO2e/bushel"]
[null,null,"VOC",0.75552649818355566,2.6284700113524333]
[null,null,"CO",7.4196917563006224,3.2528955301537494]
[null,null,"CH4",1.9010343935645428,5.9374487004087344]
[null,null,"N2O",1.8306015221492937E-2,0.77611204615524221,10.699418616296118]
[null,null,"CO2",615.26542084621849,2178.3114373452768]
[null,null,"Total, gCO2e/bushel",682.26071309105282,2571.332802454428,3188.4267476562432,{"$f":"SUM(D15:F15)","v":6442.0202632017244}]
[]
[null,null,"Sorghum Farming, Fertilizers, N2O in soil"]
[null,null,null,"Farming","Fertilizers","N2O is soil","Total, gCO2e/bushel"]
[null,null,"VOC",0.90587331877000532,2.8372222102601059]
[null,null,"CO",7.4240523696606688,3.6697143214335224]
[null,null,"CH4",2.1671043726982244,7.0329103313063337]
[null,null,"N2O",2.1981083149362379E-2,0.85546857419421163,11.606876093294462]
[null,null,"CO2",956.06916591625941,2332.2614999825964]
[null,null,"Total, gCO2e/bushel",1031.2868111985249,2777.6232631974553,3458.8490758017497,{"$f":"SUM(D24:F24)","v":7267.7591501977295}]
[]
[]
[null,null,"MDT Truck - Corn to Stack"]
[null,null,17.256321876909219,"gCO2e/bushel-mile"]
[null,null,{"$f":"(EtOH!E57)*10*C28","v":13528021749.103973},"gCO2e"]
[]
{"$rows_left_out":48}
{"sheet":"Fuel_Specs","index":3,"n_rows":48,"n_cols":9,"rows_kept":48,"cut":false,"hidden":false,"merged":[[2,1,2,2]]}
[]
["1) Specifications of Fuels"]
[null,"Heating Value",null,"Density","C ratio","S ratio","S ratio"]
[null,"LHV","HHV",null,"(% by wt)","(ppm by wt)","Actual ratio by wt","LHV/HHV","Energy Density"]
["Liquid Fuels:","BTU/gal","BTU/gal","grams/gal",null,null,null,null,"MJ/gal"]
["Gasoline blendstock",116090,124340,2819,0.86299999999999999,null,null,null,122.48143362649999]
["CARBOB",113300,121351.72710827805,2767,0.85899999999999999,null,null,null,119.53782780499999]
["Ethanol",76330,84530,2988,0.52200000000000002,0,0,0.90299302022950434,80.532413030499995]
["Gaseous Fuels (at 60F and 1atm):","BTU/ft3","BTU/ft3","grams/ft3",null,null,null,"LHV/HHV","MJ/unit"]
["Natural gas",930,1030,20.8,0.72399999999999998,6,6.0000000000000002E-6,{"$f":"B10/C10","v":0.90291262135922334},0.98]
["Pure Methane",910,1010,19.2,null,null,null,{"$f":"B11/C11","v":0.90099009900990101}]
[]
["2) Global Warming Potentials of Greenhouse Gases: relative to CO2"]
["CO2",1]
["CH4",25]
["N2O",298]
["VOC",3.1166666666666667]
["CO",1.5714285714285714]
["NO2",0]
[]
[]
["3) Unit Conversion"]
["Mass","1 g","1 kg","1 metric ton","1 lb","1 short ton"]
["g",1,1000,1000000,453.59237000000002,907184.74]
["kg",1E-3,1,1000,0.45359237000000002,907.18474000000003]
["metric ton",9.9999999999999995E-7,1E-3,1,4.5359237000000004E-4,0.90718474000000004]
["lb",2.2046226218487759E-3,2.2046226218487757,2204.6226218487759,1,2000]
["short ton",1.102311310924388E-6,1.1023113109243879E-3,1.1023113109243878,5.0000000000000001E-4,1]
[]
["Volume","1 m3","1 ml","1 L","1 gal","1 ft3"]
{"$rows_left_out":19}
{"sheet":"NG and Imported Steam","index":4,"n_rows":27,"n_cols":5,"rows_kept":27,"cut":false,"hidden":false,"merged":[[0,1,0,4]]}
[null,"MMBTU"]
["Reporting Month","Total Natural Gas Billed","Imported Steam","Boiler Efficiency to Make Steam","Total Natural Gas Usage (Field 3.2.)"]
[null,"HHV","HHV","%","HHV"]
["2017-05-01",174216.9375,3020.85,0.8,{"$f":"B4+C4/D4","v":177993}]
["2017-06-01",177153.6875,580.25,0.8,{"$f":"B5+C5/D5","v":177879}]
["2017-07-01",198249.65,1309.0800000000002,0.8,199886]
["2017-08-01",196076.86249999999,3133.71,0.8,199994]
["2017-09-01",199529.76250000001,364.99,0.8,199986]
["2017-10-01",199015.57500000001,840.34,0.8,200066]
["2017-11-01",199207.85,1492.92,0.8,201074]
["2017-12-01",198546.1,1702.3200000000002,0.8,200674]
["2018-01-01",199724.61249999999,119.50999999999999,0.8,199874]
["2018-02-01",165760.22500000001,524.62,0.8,166416]
["2018-03-01",166453.9375,627.25,0.8,167238]
["2018-04-01",179445.83749999999,452.13,0.8,180011]
["2018-05-01",183880.38750000001,2755.69,0.8,187325]
["2018-06-01",180235.6875,681.05,0.8,181087]
["2018-07-01",183584.97500000001,268.82,0.8,183921]
["2018-08-01",134437.1875,3093.45,0.8,138304]
["2018-09-01",182239.08749999999,324.73,0.8,182645]
["2018-10-01",188661.9,800.08,0.8,189662]
["2018-11-01",188114.17499999999,1452.6599999999999,0.8,189930]
["2018-12-01",183252.42499999999,1662.06,0.8,185330]
["2019-01-01",199232.9375,79.25,0.8,199332]
["2019-02-01",181492.55,484.36,0.8,182098]
["2019-03-01",199622.26250000001,586.99,0.8,200356]
["2019-04-01",177372.16250000001,411.87,0.8,177887]